{"text_format":"3","workbook":"xlsx","n_sheets":2,"sheets":["NET-PUAN-ORTALAMA","ÖĞRENCİ SONUÇ EKRANI"],"not_rendered":{"images":1},"read":"whole","date_system":"1900"}

{"sheet":"NET-PUAN-ORTALAMA","index":0,"n_rows":245,"n_cols":18,"rows_kept":245,"hidden":true,"merged":[[0,0,1,0],[0,1,1,1],[0,2,0,3],[0,4,1,4]]}
["T.C","ADI SOYADI",null,null,"DURUM"]
[null,null,"PUAN","SIRALAMA"]
[64102268706,"BETÜL ARSLAN",492.00000000000006,1,"OKULUMUZDA EĞİTİM ALMAYA HAK KAZANDINIZ","BETÜL ARSLAN",19,1,20,0,15,0,9,1,4,1,5,0]
[34006429008,"ZEYNEP SENA TÜTÜNCİ",488.00000000000006,2,"OKULUMUZDA EĞİTİM ALMAYA HAK KAZANDINIZ","ZEYNEP SENA TÜTÜNCİ",19,1,19,1,15,0,9,1,5,0,5,0]
[68287113332,"SALİH ÖZTÜRK",484,3,"OKULUMUZDA EĞİTİM ALMAYA HAK KAZANDINIZ","SALİH ÖZTÜRK",19,1,19,1,15,0,8,2,3,2,5,0]
[40631048972,"ZÜMRA SAĞLAM",481.3333333333333,4,"OKULUMUZDA EĞİTİM ALMAYA HAK KAZANDINIZ","ZÜMRA SAĞLAM",20,0,17,2,15,0,9,1,3,2,5,0]
[45337892034,"YAREN BİLGE ÇAKIR",480,5,"OKULUMUZDA EĞİTİM ALMAYA HAK KAZANDINIZ","YAREN BİLGE ÇAKIR",20,0,17,3,15,0,8,2,4,1,5,0]
[26540520778,"AZRA YOLCU",477.33333333333337,6,"OKULUMUZDA EĞİTİM ALMAYA HAK KAZANDINIZ","AZRA YOLCU",20,0,18,1,13,2,9,1,4,1,5,0]
[64663233328,"HÜSNÜ MERT CÜRE",476.6666666666667,7,"OKULUMUZDA EĞİTİM ALMAYA HAK KAZANDINIZ","HÜSNÜ MERT CÜRE",19,1,17,2,15,0,9,0,3,1,5,0]
[28864966010,"BUĞRA PARILTI",474.6666666666667,8,"OKULUMUZDA EĞİTİM ALMAYA HAK KAZANDINIZ","BUĞRA PARILTI",20,0,16,3,15,0,9,1,2,3,5,0]
[29162433358,"ZEHRA ATMACA",474.66666666666663,9,"OKULUMUZDA EĞİTİM ALMAYA HAK KAZANDINIZ","ZEHRA ATMACA",18,2,18,2,15,0,9,1,3,2,5,0]
[46963840000,"ERVANUR HACİFETTAHOĞLU",468.66666666666674,10,"OKULUMUZDA EĞİTİM ALMAYA HAK KAZANDINIZ","ERVANUR HACİFETTAHOĞLU",20,0,15,4,15,0,9,1,2,1,4,1]
[60223396618,"OSMAN EMİR GÜNAYDIN",467.99999999999994,11,"OKULUMUZDA EĞİTİM ALMAYA HAK KAZANDINIZ","OSMANEMİR GÜNAYDIN",18,2,18,2,14,1,8,2,3,2,5,0]
[50275712818,"ZEHRA DOĞAN",467.6666666666667,12,"OKULUMUZDA EĞİTİM ALMAYA HAK KAZANDINIZ","ZEHRA DOĞAN",19,0,15,3,15,0,9,0,3,1,4,0]
[13769946410,"BEYZA NUR SAĞLAM",464,13,"OKULUMUZDA EĞİTİM ALMAYA HAK KAZANDINIZ","BEYZA NUR SAĞLAM",20,0,15,5,14,1,9,1,3,2,5,0]
[46426841162,"MUSTAFA RÜZGAR ÖZTÜRK",464,14,"OKULUMUZDA EĞİTİM ALMAYA HAK KAZANDINIZ","MUSTAFA RÜZGAR ÖZTÜRK",19,1,17,3,13,2,9,1,3,2,5,0]
[38114132812,"SELİM CÖMERT",460,15,"OKULUMUZDA EĞİTİM ALMAYA HAK KAZANDINIZ","SEL İM CÖMERT",18,2,14,3,15,0,10,0,4,1,5,0]
[35513219526,"OSMAN AKİF YANAR",460,16,"OKULUMUZDA EĞİTİM ALMAYA HAK KAZANDINIZ","OSMAN AKİF YANAR",17,2,15,2,15,0,9,1,5,0,4,1]
[26246530514,"ADEM ALBAYRAK",457.33333333333337,17,"OKULUMUZDA EĞİTİM ALMAYA HAK KAZANDINIZ","ADEM ALBAYRAK",19,1,14,6,15,0,8,2,4,1,4,1]
[64789229984,"ÖMER ASAF AKYAZI",457.33333333333337,18,"OKULUMUZDA EĞİTİM ALMAYA HAK KAZANDINIZ","ÖMER ASAF AKYAZI",15,4,17,2,15,0,9,1,4,1,5,0]
[39617082758,"AHMET BARAN DEMİR",455.99999999999994,19,"OKULUMUZDA EĞİTİM ALMAYA HAK KAZANDINIZ","AHMET BARAN DEMİR",18,2,14,5,15,0,10,0,3,2,5,0]
[41186030474,"MERVE NAZ AKSOY",455.33333333333337,20,"OKULUMUZDA EĞİTİM ALMAYA HAK KAZANDINIZ","MERVE NAZ AKSOY",20,0,12,3,14,1,8,1,4,0,5,0]
[66634342442,"AFFAN ALP ÇINAR",455.3333333333333,21,"OKULUMUZDA EĞİTİM ALMAYA HAK KAZANDINIZ","AFFAN ALP ÇINAR",18,2,15,2,14,1,8,1,2,2,5,0]
[31109368494,"SERRA SAYİN",452.33333333333337,22,"OKULUMUZDA EĞİTİM ALMAYA HAK KAZANDINIZ","SERRA SAYİN",19,1,13,5,14,1,9,0,4,1,5,0]
[42361976648,"MERYEM BIYIK",451,23,"OKULUMUZDA EĞİTİM ALMAYA HAK KAZANDINIZ","MERYEM BIYIK",18,1,14,2,14,1,8,2,1,3,5,0]
[50881709424,"ALİ KEMAL GÜZELCİK",450.6666666666667,24,"OKULUMUZDA EĞİTİM ALMAYA HAK KAZANDINIZ","ALİ KEMAL GÜZELCİK",19,1,13,7,15,0,8,2,2,3,5,0]
[12725964512,"YUSUF BERA ERDEM",450.6666666666667,25,"OKULUMUZDA EĞİTİM ALMAYA HAK KAZANDINIZ","YUSUF BERA ERDEM",19,1,13,5,14,1,9,1,3,2,5,0]
[29174432912,"EGEMEN SAĞLAM",450.6666666666667,26,"OKULUMUZDA EĞİTİM ALMAYA HAK KAZANDINIZ","EGEMEN SAĞLAM",16,4,15,5,15,0,10,0,4,1,5,0]
[34616251570,"FIRAT YILDIZ",450.3333333333333,27,"OKULUMUZDA EĞİTİM ALMAYA HAK KAZANDINIZ","FIRAT YILDIZ",18,2,16,2,13,2,6,3,3,1,3,1]
[41789010392,"RABİA ÖZER",450,28,"OKULUMUZDA EĞİTİM ALMAYA HAK KAZANDINIZ","RABİA ÖZER",18,0,13,2,14,1,8,2,2,1,5,0]
[42496988820,"SÜVEYBE BİRİNCİ",449.6666666666667,29,"OKULUMUZDA EĞİTİM ALMAYA HAK KAZANDINIZ","SÜVEYBE BİRİNCİ",16,3,16,1,13,1,9,0,3,2,5,0]
[45289893660,"MUHAMMED TARIK YILMAZ",449.33333333333337,30,"OKULUMUZDA EĞİTİM ALMAYA HAK KAZANDINIZ","MUHAMMED TARIK YILMAZ",19,1,14,4,14,1,5,5,1,0,5,0]
[64585403410,"MUHAMMED CANKURT",448.00000000000006,31,"OKULUMUZDA EĞİTİM ALMAYA HAK KAZANDINIZ","MUHAMMED CANKURT",19,1,13,7,15,0,6,4,3,2,4,1]
[38486105858,"EDİZ ÖKTEM KARA",447.3333333333333,32,"OKULUMUZDA EĞİTİM ALMAYA HAK KAZANDINIZ","EDİZ ÖKTEM K* A",18,1,15,5,13,2,9,0,1,3,5,0]
[20699715436,"ERVA SAYIN",447.00000000000006,33,"OKULUMUZDA EĞİTİM ALMAYA HAK KAZANDINIZ","ERVAS AYIN",19,1,13,4,13,1,8,2,3,1,5,0]
[14813911682,"YUSUF EMİR SALİH",446.66666666666663,34,"OKULUMUZDA EĞİTİM ALMAYA HAK KAZANDINIZ","YUSUF EMİR SALİH",18,2,13,5,14,1,8,2,5,0,5,0]
[65041237402,"AHMET ALİ HALİLOĞLU",442.6666666666667,35,"OKULUMUZDA EĞİTİM ALMAYA HAK KAZANDINIZ","AHMET ALİ HALİLOĞLU",19,1,11,9,15,0,8,2,4,1,5,0]
[35867209808,"MEHMET EMİN KALYONCU",440,36,"OKULUMUZDA EĞİTİM ALMAYA HAK KAZANDINIZ","MEHMET EMİN KALYONCU",17,3,13,6,14,1,8,2,5,0,5,0]
[51508200966,"EREN AKKUŞ",438.6666666666667,37,"OKULUMUZDA EĞİTİM ALMAYA HAK KAZANDINIZ","EREN AKKUŞ",18,2,12,7,14,1,8,2,4,1,5,0]
[11136032872,"GAMZE BAKİ",437.3333333333333,38,"OKULUMUZDA EĞİTİM ALMAYA HAK KAZANDINIZ","GAMZE BAKİ",17,3,12,2,14,1,8,2,3,2,4,1]
[40919039364,"NURSENA KAYAR",437.00000000000006,39,"OKULUMUZDA EĞİTİM ALMAYA HAK KAZANDINIZ","NURSENA KAYAR",16,3,14,4,14,1,7,2,2,1,4,1]
[41717179580,"EMİR YAŞAR",436,40,"OKULUMUZDA EĞİTİM ALMAYA HAK KAZANDINIZ","EMİR YAŞAR",18,2,12,6,14,1,8,2,1,4,5,0]
[14895066492,"MİRAÇ GELDİ",436,41,"OKULUMUZDA EĞİTİM ALMAYA HAK KAZANDINIZ","MİRAÇ GELDİ",17,3,13,5,14,1,7,3,2,3,5,0]
[36086200454,"YAĞIZ AVCI",435,42,"OKULUMUZDA EĞİTİM ALMAYA HAK KAZANDINIZ","YAĞIZ AVCI",17,3,13,6,14,1,7,2,2,3,5,0]
[46021871458,"AHSEN ŞURUTOĞLU",435,43,"OKULUMUZDA EĞİTİM ALMAYA HAK KAZANDINIZ","AHSEN ŞURUTOĞLU",17,2,10,4,15,0,9,1,2,2,5,0]
[13238964174,"ÇINAR GÜNAYDIN",431.3333333333333,44,"OKULUMUZDA EĞİTİM ALMAYA HAK KAZANDINIZ","ÇINAR GÜNAYDIN",16,4,11,1,15,0,7,2,2,2,3,2]
[21532350708,"BERİL TOPAL",430.66666666666674,45,"OKULUMUZDA EĞİTİM ALMAYA HAK KAZANDINIZ","BERİL TOPAL",18,1,9,7,14,1,9,1,5,0,5,0]
[62554320300,"ZEYNEP KARACA",430.6666666666667,46,"OKULUMUZDA EĞİTİM ALMAYA HAK KAZANDINIZ","ZEYNEP KARACA",18,2,9,4,14,1,8,2,4,1,5,0]
[57073503044,"SİMAY SAĞLAM",429.99999999999994,47,"OKULUMUZDA EĞİTİM ALMAYA HAK KAZANDINIZ","SİMAY SAĞLAM",18,2,12,5,12,2,9,1,1,2,5,0]
[24167589856,"AHMET EMİN KAHRAMAN",429.33333333333337,48,"OKULUMUZDA EĞİTİM ALMAYA HAK KAZANDINIZ","AHMET EMİN KAHRAMAN",16,4,15,5,12,3,9,1,2,3,4,1]
[17699792000,"ESLEM ZENGİN",429.00000000000006,49,"OKULUMUZDA EĞİTİM ALMAYA HAK KAZANDINIZ","ESLEM ZENGİN",17,1,9,4,14,0,9,1,2,0,5,0]
[58411458422,"ASYA KARADENİZ",426.6666666666667,50,"OKULUMUZDA EĞİTİM ALMAYA HAK KAZANDINIZ","ASYA KARADENİZ",18,2,12,6,12,3,7,3,4,1,4,1]
[45703881938,"TAHA YAĞIZ AYDIN",425.3333333333333,51,"OKULUMUZDA EĞİTİM ALMAYA HAK KAZANDINIZ","TAHA AYDIN",15,5,12,8,15,0,8,2,4,1,4,1]
[22034826210,"HATİCE DİLAY ERABDAN",424,52,"OKULUMUZDA EĞİTİM ALMAYA HAK KAZANDINIZ","HATİCE DİLAY ERABDAN",17,3,10,4,13,2,9,1,3,2,5,0]
[54286307476,"ZEREN SULTAN KARAKAYA",423.00000000000006,53,"OKULUMUZDA EĞİTİM ALMAYA HAK KAZANDINIZ","ZEREN SULTAN KARAKAYA",19,1,11,6,11,4,8,2,3,1,4,1]
[41221671464,"TAHA ATALAR",423,54,"OKULUMUZDA EĞİTİM ALMAYA HAK KAZANDINIZ","TAHA ATALAR",12,2,13,0,14,0,5,1,0,0,5,0]
[51259579014,"YAĞMUR LİKOS",422.6666666666667,55,"OKULUMUZDA EĞİTİM ALMAYA HAK KAZANDINIZ","YAĞMUR LİKOS",19,1,8,7,13,2,7,3,5,0,5,0]
[42358993542,"SALİHA BETÜL TURAN",422.66666666666663,56,"OKULUMUZDA EĞİTİM ALMAYA HAK KAZANDINIZ","SALİHA BETÜL TURAN",17,2,9,5,14,1,9,1,3,2,3,2]
[39404089816,"POYRAZ ARAF YILMAZ",421,57,"OKULUMUZDA EĞİTİM ALMAYA HAK KAZANDINIZ","POYRAZ ARAF YILMAZ",18,0,10,7,12,2,7,2,2,1,5,0]
[12503354238,"ECEM BETÜL BEREKET",420.3333333333333,58,"OKULUMUZDA EĞİTİM ALMAYA HAK KAZANDINIZ","ECEM BETÜL BEREKET",17,3,9,9,15,0,8,2,2,2,4,1]
[45268896514,"GAMZE AYDIN",417.6666666666667,59,"OKULUMUZDA EĞİTİM ALMAYA HAK KAZANDINIZ","GAMZE AYDIN",17,3,10,10,14,1,8,2,2,2,4,1]
[72088002580,"ZÜMRA KAYA",417.33333333333337,60,"OKULUMUZDA EĞİTİM ALMAYA HAK KAZANDINIZ","ZÜMRAKAYA",18,2,8,9,14,1,9,1,2,3,4,1]
[20099735454,"YİĞİT SADE",417.3333333333333,61,"OKULUMUZDA EĞİTİM ALMAYA HAK KAZANDINIZ","YİĞİT SADE",18,2,10,10,13,2,9,1,0,5,5,0]
[55708548552,"YUSUF MİRZA SAĞLAM",416.3333333333333,62,"OKULUMUZDA EĞİTİM ALMAYA HAK KAZANDINIZ","YUSUF MİRZA SAĞLAM",18,2,9,6,12,3,9,1,2,2,5,0]
[23918608120,"MEHMET AKİF FİL",416.00000000000006,63,"OKULUMUZDA EĞİTİM ALMAYA HAK KAZANDINIZ","MEHMET AKİF FİL",16,4,11,9,13,2,9,1,4,1,4,1]
[46678832734,"MELİKE EZGİ ÖZTÜRK",415.66666666666674,64,"OKULUMUZDA EĞİTİM ALMAYA HAK KAZANDINIZ","MELİKE EZGİ ÖZTÜRK",19,1,10,6,11,4,9,1,2,1,0,0]
[52483656076,"AHMET YAVUZ SAĞLAM",414.6666666666667,65,"OKULUMUZDA EĞİTİM ALMAYA HAK KAZANDINIZ","AHMET YAVUZ SAĞLAM",16,4,11,8,13,2,7,3,4,1,4,1]
[27950364938,"FATMA NEVAL AYAL",413.6666666666667,66,"OKULUMUZDA EĞİTİM ALMAYA HAK KAZANDINIZ","FATMA NEVAL AYAL",17,1,7,5,13,1,8,1,3,2,5,0]
[31804600158,"NURCAN GÜDÜK",413.3333333333333,67,"OKULUMUZDA EĞİTİM ALMAYA HAK KAZANDINIZ","NURCAN GÜDÜK Ü",18,2,10,6,12,3,7,3,2,3,2,3]
[57187499202,"HAMZA ALP",413.33333333333326,68,"OKULUMUZDA EĞİTİM ALMAYA HAK KAZANDINIZ","HAMZA ALP",18,2,6,5,14,1,8,2,3,2,3,2]
[38933259776,"ZEYNEP YAVUZYILMAZ",412,69,"OKULUMUZDA EĞİTİM ALMAYA HAK KAZANDINIZ","ZEYNEP YAVUZYILMAZ",12,8,11,4,15,0,8,2,4,1,5,0]
[66193362332,"AYŞENUR BUĞLEM BİRİNCİ",411.6666666666667,70,"OKULUMUZDA EĞİTİM ALMAYA HAK KAZANDINIZ","AYŞENUR BUĞLEM BİRİNCİ",18,2,9,6,11,1,8,1,2,2,3,1]
[16157866864,"DİLEK NİSA ÇALIŞ",410.66666666666674,71,"OKULUMUZDA EĞİTİM ALMAYA HAK KAZANDINIZ","DİLEK NİSA ÇALIŞ",15,3,10,10,14,1,7,3,4,1,4,1]
[18695765524,"MUHAMMET TALHA TULUMEN",410.66666666666674,72,"OKULUMUZDA EĞİTİM ALMAYA HAK KAZANDINIZ","MUHAMMET TALHA TULUMEN",15,4,11,9,14,1,7,3,1,4,4,1]
[10296219796,"SIRAÇ HAKKI ÇALIŞKAN",409.6666666666667,73,"YETERLİ PUAN ALAMADINIZ","SIRAÇ HAKKI ÇALIŞKAN",17,3,7,9,14,1,9,1,2,2,5,0]
[23431762750,"ESLEM TAN",409.33333333333337,74,"YETERLİ PUAN ALAMADINIZ","ESLEM TAN",17,3,10,10,12,3,6,4,5,0,5,0]
[53575619450,"GÖKAY KERİM",409.33333333333337,75,"YETERLİ PUAN ALAMADINIZ","GÖKAY KERİM",18,2,7,13,15,0,6,4,2,3,4,1]
[30458542944,"ASİL BULUT BURBUT",409.3333333333333,76,"YETERLİ PUAN ALAMADINIZ","ASİLBULUT BURBUT",16,4,8,5,13,2,9,1,3,2,5,0]
[44065934498,"MELİSA TONK",408.6666666666667,77,"YETERLİ PUAN ALAMADINIZ","MELİSA TONK",16,3,8,7,14,1,8,2,2,1,3,2]
[13667948486,"ZAFER BİLGİN",408.3333333333333,78,"YETERLİ PUAN ALAMADINIZ","ZAFER BİLGİN",15,4,8,8,15,0,8,2,1,3,5,0]
[25862543342,"MUHAMMET YAĞIZ BİLGİN",408.00000000000006,79,"YETERLİ PUAN ALAMADINIZ","MUHAMM* YAĞIZ BİLGİN",16,3,8,10,14,1,9,1,3,2,4,1]
[19751747034,"İCLAL ALBAYRAK",408,80,"YETERLİ PUAN ALAMADINIZ","İCLAL A LAYRAK",19,1,8,12,12,3,7,3,3,2,5,0]
[64948224638,"AYŞE SU TURGUT",406.6666666666667,81,"YETERLİ PUAN ALAMADINIZ","AYŞE SU TURGUT",17,3,7,12,14,1,9,1,3,2,5,0]
[31922339282,"ZÜMRA KAVAL",406.00000000000006,82,"YETERLİ PUAN ALAMADINIZ","ZÜMRA KAVAL",16,1,7,7,13,2,7,1,4,1,5,0]
[52492655794,"MAHMUT BAYBARS GÜNER",406,83,"YETERLİ PUAN ALAMADINIZ","MAHMUTBAYBARS GÜNER",16,3,8,5,12,1,9,1,2,2,4,0]
[57241497380,"İREM MOLLAAHMETOĞLU",405,84,"YETERLİ PUAN ALAMADINIZ","İREMMOLL AAHMETOĞLU",16,4,10,5,11,3,6,2,3,1,5,0]
[14522904692,"ALP YAMAN KABA",404.6666666666667,85,"YETERLİ PUAN ALAMADINIZ","ALP YAMAN KABA",14,4,10,3,13,2,9,1,0,0,0,0]
[27530487736,"MUHAMMET İSMAİL ÇALIŞ",403.00000000000006,86,"YETERLİ PUAN ALAMADINIZ","MUHAMMET İSMAİL ÇALIŞ",14,5,8,7,14,1,8,1,4,1,5,0]
[41522021456,"ÖZGE SAĞLAM",402.6666666666667,87,"YETERLİ PUAN ALAMADINIZ","ÖZGE SAĞLAM",17,3,9,10,12,3,7,3,2,3,5,0]
[14837909450,"MUSTAFA HAMZA KALYONCU",401.6666666666667,88,"YETERLİ PUAN ALAMADINIZ","MUSTAFA HAMZA KALYONCU",13,6,8,6,15,0,8,2,3,1,4,1]
[64687249220,"YUSUF KARANİS",400,89,"YETERLİ PUAN ALAMADINIZ","YUSUF KARANİS",17,3,10,10,11,4,7,3,3,2,3,2]
[69937237590,"ÖZER ASAF SİYAH",398.6666666666667,90,"YETERLİ PUAN ALAMADINIZ","ÖZER ASAF SİYAH",16,4,5,5,14,1,7,3,3,2,4,1]
[33176299572,"ZEYNEP KOYUN",398.6666666666667,91,"YETERLİ PUAN ALAMADINIZ","ZEYNEP KOYUN",17,3,7,7,12,3,8,2,2,3,4,1]
[73171129764,"ZEYNEP ESLEM ZENBİL",398.66666666666663,92,"YETERLİ PUAN ALAMADINIZ","ZEYNEP ESLEM ZENBİL",18,2,8,12,13,2,3,7,3,2,2,3]
[61333337560,"ZEYNEP ŞURA KAHRAMAN",398.33333333333337,93,"YETERLİ PUAN ALAMADINIZ","ZEYNEP ŞURA KAHRAMAN",15,3,11,5,11,4,6,1,0,3,2,1]
[16841828154,"OLCAY ÖZKAN",393.33333333333326,94,"YETERLİ PUAN ALAMADINIZ","OLCAY ÖZKAN",15,5,12,8,9,6,8,2,3,2,5,0]
[28187465764,"MUHAMMET EMRE HALİLOĞLU",392,95,"YETERLİ PUAN ALAMADINIZ","MUHAMHET EMRE HALİLOĞLU",19,0,6,14,11,3,7,3,4,1,2,3]
[58447455822,"BÜŞRA KÜÇÜKBİRİNCİ",390.6666666666667,96,"YETERLİ PUAN ALAMADINIZ","BÜŞRA KÜÇÜKBİRİNCİ",14,6,11,7,10,5,9,1,3,2,4,1]
[16655833580,"MİRAÇ BABAYİĞİT",389.6666666666667,97,"YETERLİ PUAN ALAMADINIZ","MİRAÇ BABAYİĞİT",12,6,10,1,10,0,6,0,2,0,3,0]
[36380192776,"MUHAMMET EMİN YILMAZ",389.33333333333326,98,"YETERLİ PUAN ALAMADINIZ","MUHAMMETEMİNYYILMAZ",17,3,6,14,13,2,7,3,3,2,3,2]
[19205763856,"ZEYNEP ELİF BAHADIR",388,99,"YETERLİ PUAN ALAMADINIZ","ZEYNEP ELİF BAHADIR",16,4,10,9,10,5,5,5,1,4,5,0]
[74257093580,"EMİR EFE SEVGİ",387.33333333333337,100,"YETERLİ PUAN ALAMADINIZ","EMİR EF* SEVGİ",14,5,7,13,14,1,8,1,1,3,5,0]
[58156451016,"ELİF KÖSE",386.66666666666674,101,"YETERLİ PUAN ALAMADINIZ","ELİF KÖSE",14,6,11,9,11,4,6,4,1,4,4,1]
[70573037192,"ASAF KAYA",386.6666666666667,102,"YETERLİ PUAN ALAMADINIZ","Lİ NA * GÜN",19,1,3,10,12,3,7,3,2,3,3,2]
[61024371330,"LİNA AYGÜN",386.6666666666667,103,"YETERLİ PUAN ALAMADINIZ","ASAF KAYA",12,8,10,10,14,1,5,5,2,3,4,1]
[27484937790,"İKRA GEDİK",385.66666666666663,104,"YETERLİ PUAN ALAMADINIZ","İKRA GEDİK",13,7,8,11,15,0,4,5,2,3,3,2]
[57379492882,"ECENUR ÖZGÜR",384,105,"YETERLİ PUAN ALAMADINIZ","ECENUR ÖZGÜR",15,5,10,4,8,6,7,3,2,3,5,0]
[26333684274,"AHMET ÖZKUL",382.6666666666667,106,"YETERLİ PUAN ALAMADINIZ","AHMET ÖZKUL",15,5,8,12,12,3,9,1,2,3,1,4]
[21893659700,"EZRA MELEK KURT",382.33333333333337,107,"YETERLİ PUAN ALAMADINIZ","EZRA MELEK KURT",12,4,9,3,10,3,6,1,2,0,4,0]
[72217161546,"YAĞIZ GÖZAÇAN",381.66666666666663,108,"YETERLİ PUAN ALAMADINIZ","YAĞIZ GÖZAÇAN",14,5,6,11,13,1,8,2,1,3,5,0]
[68263114124,"HİLAL USTA",381.3333333333333,109,"YETERLİ PUAN ALAMADINIZ","HİLAL USTA",11,3,8,3,11,2,8,1,1,2,4,0]
[35450223778,"BAHAR ÇİMŞİT",381.3333333333333,110,"YETERLİ PUAN ALAMADINIZ","BAHAR ÇİMŞİT",17,3,7,11,10,5,7,3,2,3,4,1]
[25820544886,"NURAY COBANTÜRK",380.3333333333333,111,"YETERLİ PUAN ALAMADINIZ","NURAY COBANTÜRK",17,3,6,13,12,2,5,3,1,2,1,3]
[12950957884,"ONUR YASİN BİRİNCİ",378.6666666666667,112,"YETERLİ PUAN ALAMADINIZ","ONUR YASİN BİRİNCİ",16,4,7,13,11,4,7,3,3,2,3,2]
[28601452042,"ABDULLAH YASİN UĞURLU",376.00000000000006,113,"YETERLİ PUAN ALAMADINIZ","ABDULLAH YASİN UĞURLU",10,5,7,7,13,1,9,1,1,4,5,0]
[55792545710,"BELİNAY KARADENİZ",376,114,"YETERLİ PUAN ALAMADINIZ","BELİNAY KARADENİZ",12,8,8,10,13,2,8,2,1,4,4,1]
[17621801398,"MUHAMMET TAHA SARITAŞ",374.6666666666667,115,"YETERLİ PUAN ALAMADINIZ","MUHAMMET TAHA SARITAŞ",17,3,7,13,9,6,8,2,1,4,5,0]
[44737914100,"RABİA BİLGİN",370.66666666666663,116,"YETERLİ PUAN ALAMADINIZ","RABİA BİLGİN",15,5,7,6,10,5,4,6,2,3,2,3]
[56449523716,"MURAT ZER",369.66666666666674,117,"YETERLİ PUAN ALAMADINIZ","MURAT ZER",9,10,11,7,11,4,7,3,4,0,4,1]
[13427941900,"İSMAİL EREN ÇABUK",369.3333333333334,118,"YETERLİ PUAN ALAMADINIZ","İSMAİL EREN ÇABUK",13,7,7,13,12,3,9,1,1,4,4,1]
{"$rows_left_out":126}
{"sheet":"ÖĞRENCİ SONUÇ EKRANI","index":1,"n_rows":29,"n_cols":16,"rows_kept":29,"merged":[[8,1,17,4],[8,11,17,21],[11,5,12,10],[13,5,13,10],[14,5,14,10],[16,6,16,9],[18,1,19,4],[18,5,19,10],[18,11,19,15],[20,1,21,4],[20,5,21,10],[20,11,21,15],[25,2,25,3],[25,4,25,5],[25,6,25,7],[25,8,25,9],[25,10,25,11],[25,12,25,13],[28,3,28,12]]}
{"$rows_empty":11}
[{"$nulls":5},"HİKMET KAAN İMAM HATİP"]
[]
[{"$nulls":5},"ORTAOKULU SONUÇ EKRANI"]
[{"$nulls":5},"TC KİMLİK NO"]
[]
[]
[]
[null,"ADI SOYADI",{"$nulls":3},"SINAV PUANI",{"$nulls":5},"BAŞVURDUĞU ALANA GÖRE\nSINAV SIRALAMASI"]
[]
[null,{"$f":"VLOOKUP(G17,'NET-PUAN-ORTALAMA'!A3:E300,2,0)","v":{"$error":"#N/A"}},{"$nulls":3},{"$f":"VLOOKUP(G17,'NET-PUAN-ORTALAMA'!A3:E300,3,0)","v":{"$error":"#N/A"}},{"$nulls":5},{"$f":"VLOOKUP(G17,'NET-PUAN-ORTALAMA'!A3:E300,4,0)","v":{"$error":"#N/A"}},{"$f":"VLOOKUP(O17,'NET-PUAN-ORTALAMA'!H3:M300,4,0)","v":15},{"$f":"VLOOKUP(P17,'NET-PUAN-ORTALAMA'!I3:N300,4,0)","v":2},{"$f":"VLOOKUP(Q17,'NET-PUAN-ORTALAMA'!J3:O300,4,0)","v":9},{"$f":"VLOOKUP(R17,'NET-PUAN-ORTALAMA'!K3:P300,4,0)","v":7}]
[]
[]
[]
[]
[null,null,"TÜRKÇE",null,"MATEMATİK",null,"FEN BİLİMLERİ",null,"SOSYAL BİLGİLER",null,"DİN KÜLTÜRÜ",null,"İNGİLİZCE"]
[null,null,{"$f":"VLOOKUP(G17,'NET-PUAN-ORTALAMA'!A3:R300,7,0)","v":{"$error":"#N/A"}},{"$f":"VLOOKUP(G17,'NET-PUAN-ORTALAMA'!A3:R300,8,0)","v":{"$error":"#N/A"}},{"$f":"VLOOKUP(G17,'NET-PUAN-ORTALAMA'!A3:R300,9,0)","v":{"$error":"#N/A"}},{"$f":"VLOOKUP(G17,'NET-PUAN-ORTALAMA'!A3:R300,10,0)","v":{"$error":"#N/A"}},{"$f":"VLOOKUP(G17,'NET-PUAN-ORTALAMA'!A3:R300,11,0)","v":{"$error":"#N/A"}},{"$f":"VLOOKUP(G17,'NET-PUAN-ORTALAMA'!A3:R300,12,0)","v":{"$error":"#N/A"}},{"$f":"VLOOKUP(G17,'NET-PUAN-ORTALAMA'!A3:R300,13,0)","v":{"$error":"#N/A"}},{"$f":"VLOOKUP(G17,'NET-PUAN-ORTALAMA'!A3:R300,14,0)","v":{"$error":"#N/A"}},{"$f":"VLOOKUP(G17,'NET-PUAN-ORTALAMA'!A3:R300,15,0)","v":{"$error":"#N/A"}},{"$f":"VLOOKUP(G17,'NET-PUAN-ORTALAMA'!A3:R300,16,0)","v":{"$error":"#N/A"}},{"$f":"VLOOKUP(G17,'NET-PUAN-ORTALAMA'!A3:R300,17,0)","v":{"$error":"#N/A"}},{"$f":"VLOOKUP(G17,'NET-PUAN-ORTALAMA'!A3:R300,18,0)","v":{"$error":"#N/A"}}]
[]
[{"$nulls":3},{"$f":"VLOOKUP(G17,'NET-PUAN-ORTALAMA'!A3:E300,5,0)","v":{"$error":"#N/A"}}]