{"text_format":"3","workbook":"xlsx","n_sheets":2,"sheets":["NET-PUAN-ORTALAMA","ÖĞRENCİ SONUÇ EKRANI"],"not_rendered":{"images":1},"read":"whole","date_system":"1900"}

{"sheet":"NET-PUAN-ORTALAMA","index":0,"n_rows":148,"n_cols":16,"rows_kept":148,"hidden":true,"merged":[[0,0,1,0],[0,1,1,1],[0,2,0,3],[0,4,0,5],[0,6,0,7],[0,8,0,9],[0,10,0,11],[0,12,0,13],[0,14,1,14],[0,15,1,15]]}
["T.C","ADI SOYADI (BÜYÜK HARFLE YAZINIZ)","TÜRKÇE",null,"MATEMATİK",null,"FEN",null,"SOSYAL",null,"DİN",null,"İMGİLİZCE",null,"PUAN","DURUM"]
[null,null,true,false,true,false,true,false,true,false,true,false,true,false]
[55987525916,"HATİCE BÜŞRA SİLİNGAR",16,4,16,4,14,1,6,4,5,0,4,1,445.38000000000005,"HAFIZLIK YAZ EĞİTİMİNE HAK KAZANDINIZ"]
[12468141928,"SÜEYYE KARAŞ",16,4,14,5,14,1,8,2,3,2,4,1,436.01,"HAFIZLIK YAZ EĞİTİMİNE HAK KAZANDINIZ"]
[51367693190,"FİRDEVS BEKTAŞ",17,3,16,4,11,4,6,4,3,2,1,4,428.03000000000003,"HAFIZLIK YAZ EĞİTİMİNE HAK KAZANDINIZ"]
[28081747478,"HATİCE BÜŞRA GÖKÇEK",13,3,13,1,14,0,6,1,3,1,3,1,425.69000000000005,"HAFIZLIK YAZ EĞİTİMİNE HAK KAZANDINIZ"]
[34771522652,"EMİNE ERVA YILMAZ",17,2,14,3,10,5,7,3,4,1,2,3,421.31,"HAFIZLIK YAZ EĞİTİMİNE HAK KAZANDINIZ"]
[41588017790,"BERRA UZUN",14,6,15,5,12,3,7,3,3,2,3,2,415.97999999999996,"HAFIZLIK YAZ EĞİTİMİNE HAK KAZANDINIZ"]
[58279462722,"HAYRUNNİSA ALBAYRAK",15,3,14,3,10,3,7,1,3,2,2,2,414.33,"HAFIZLIK YAZ EĞİTİMİNE HAK KAZANDINIZ"]
[58822442522,"EMİNE ZEYNEP MUHCU",13,3,8,0,15,0,7,3,5,0,2,2,412.33,"HAFIZLIK YAZ EĞİTİMİNE HAK KAZANDINIZ"]
[60823377994,"ESMANUR SAĞLAM",15,5,14,6,11,4,8,2,3,2,3,2,411.98999999999995,"HAFIZLIK YAZ EĞİTİMİNE HAK KAZANDINIZ"]
[22190648978,"ZEHRA NİSA KALYONCU",17,3,7,5,13,2,8,2,3,2,4,1,407.96999999999997,"HAFIZLIK YAZ EĞİTİMİNE HAK KAZANDINIZ"]
[55747533908,"HATİCEKÜBRA SİLİNGAR",14,6,10,10,12,3,6,4,4,1,1,4,386.69000000000005,"HAFIZLIK YAZ EĞİTİMİNE HAK KAZANDINIZ"]
[43459956634,"MİNE ZÜMRA BAHADIR",13,7,12,8,10,5,6,4,4,1,4,1,385.33000000000004,"HAFIZLIK YAZ EĞİTİMİNE HAK KAZANDINIZ"]
[71461001370,"BÜŞRA YILMAZ",13,7,9,10,12,3,6,4,3,2,2,2,377.69,"HAFIZLIK YAZ EĞİTİMİNE HAK KAZANDINIZ"]
[50773712822,"ECRİN KILIÇ",14,4,9,4,8,7,6,3,4,1,2,3,373.71000000000004,"HAFIZLIK YAZ EĞİTİMİNE HAK KAZANDINIZ"]
[30590385676,"AZRA ÇABUK",11,9,9,11,12,3,8,2,3,2,1,4,366.65,"HAFIZLIK YAZ EĞİTİMİNE HAK KAZANDINIZ"]
[15879039440,"ESLEM ELİF BULUT",14,6,6,14,11,4,8,2,3,2,3,2,363.98999999999995,"HAFIZLIK YAZ EĞİTİMİNE HAK KAZANDINIZ"]
[19478756074,"ŞEYMA KILIÇ",14,4,8,7,8,6,6,4,2,2,1,2,363.69,"HAFIZLIK YAZ EĞİTİMİNE HAK KAZANDINIZ"]
[52567651096,"ŞEVVAL KAHRAMAN",14,5,6,14,11,4,6,4,3,2,3,2,362.65,"HAFIZLIK YAZ EĞİTİMİNE HAK KAZANDINIZ"]
[13406234856,"KEVSER YÜCEL",12,8,9,8,8,7,5,5,3,2,2,3,351.97999999999996,"HAFIZLIK YAZ EĞİTİMİNE HAK KAZANDINIZ"]
[18281795652,"MERYEM ÇALIŞ",12,4,6,14,10,5,6,4,3,2,2,3,349.32,"HAFIZLIK YAZ EĞİTİMİNE HAK KAZANDINIZ"]
[32366326494,"TUĞBA SİNAN",11,9,11,9,7,8,4,6,2,3,3,2,346.65,"HAFIZLIK YAZ EĞİTİMİNE HAK KAZANDINIZ"]
[71026037882,"RUKİYE BAHADIR",9,11,9,11,10,5,6,4,5,0,2,3,346.63,"HAFIZLIK YAZ EĞİTİMİNE HAK KAZANDINIZ"]
[18800055052,"FATIMATÜZZEHRA DOĞAN",10,9,7,5,9,6,3,1,0,0,0,0,339.99,"HAFIZLIK YAZ EĞİTİMİNE HAK KAZANDINIZ"]
[32177332738,"HİRANUR GÜNAYDIN",7,12,10,3,8,7,4,6,3,2,1,4,334.68,"KAZANAMADINIZ"]
[38087119940,"AYSE SENA USTA",11,9,9,10,6,9,4,6,2,3,0,5,328.01,"KAZANAMADINIZ"]
[17999788604,"RAVZA KAYA",9,11,6,14,9,6,4,6,3,2,0,5,317.29999999999995,"KAZANAMADINIZ"]
[50461723222,"İPEK KARAGÖL",11,9,9,11,4,11,1,9,2,3,1,4,313.31,"KAZANAMADINIZ"]
[11820011374,"HATİCE REYHAN BİRİNCİ",10,10,4,16,7,8,2,8,3,2,3,2,302.66999999999996,"KAZANAMADINIZ"]
[19202765204,"NİL KARADENİZ",8,12,9,11,3,12,1,9,2,3,2,3,293.32,"KAZANAMADINIZ"]
[41717014836,"GAMZE KARKAÇ",9,11,3,17,6,9,3,7,1,4,2,3,283.98,"KAZANAMADINIZ"]
[45379890678,"ZEYNEP ŞURA KÖSE",4,16,5,15,7,8,6,4,2,3,0,5,276,"KAZANAMADINIZ"]
[18485689740,"ESLEM KALKAN",5,15,5,15,5,10,3,7,1,4,2,3,268.02000000000004,"KAZANAMADINIZ"]
[]
[33289573842,"EYMEN İBİLİ",18,2,17,2,13,2,9,1,4,1,5,0,461.3,"HAFIZLIK YAZ EĞİTİMİNE HAK KAZANDINIZ"]
[13115353114,"MEHMET AKİF YEŞİLYURT",18,2,16,1,12,3,7,1,3,1,0,2,444.67,"HAFIZLIK YAZ EĞİTİMİNE HAK KAZANDINIZ"]
[69874074128,"EYYÜB ENSAR BEKAR",15,4,17,2,12,3,8,2,4,1,4,1,438.67,"HAFIZLIK YAZ EĞİTİMİNE HAK KAZANDINIZ"]
[54721731224,"MUSAB MOLLAOĞLU",16,3,18,2,10,4,8,1,3,2,3,2,436.33,"HAFIZLIK YAZ EĞİTİMİNE HAK KAZANDINIZ"]
[49333760892,"BİLAL AYDIN",15,2,13,4,14,1,8,0,3,1,2,1,431.02000000000004,"HAFIZLIK YAZ EĞİTİMİNE HAK KAZANDINIZ"]
[25141814040,"EMRE TALHA KOÇ",15,5,13,4,14,1,8,2,2,3,3,2,425.34,"HAFIZLIK YAZ EĞİTİMİNE HAK KAZANDINIZ"]
[11507287528,"AHMET ŞAMİL KAVANOZ",15,4,11,1,14,1,7,2,4,1,3,1,424.71000000000004,"HAFIZLIK YAZ EĞİTİMİNE HAK KAZANDINIZ"]
[58384459242,"EMİR SEFA UÇAR",12,8,14,3,15,0,9,1,4,1,2,3,422.66,"HAFIZLIK YAZ EĞİTİMİNE HAK KAZANDINIZ"]
[37433157520,"EGEMEN BALTA",15,5,14,6,12,3,8,2,3,2,4,1,418.65,"HAFIZLIK YAZ EĞİTİMİNE HAK KAZANDINIZ"]
[63178299454,"MUHAMMET SERKAN AYDIN",16,4,10,3,13,2,8,1,5,0,1,4,416.34000000000003,"HAFIZLIK YAZ EĞİTİMİNE HAK KAZANDINIZ"]
[15557163160,"ÖMER FARUK EYÜBOĞLU",16,3,12,5,12,3,9,0,2,2,1,3,415.65,"HAFIZLIK YAZ EĞİTİMİNE HAK KAZANDINIZ"]
[59422402862,"İSMAİL BERAT TULUMEN",13,5,12,2,14,0,6,2,3,2,2,3,415.29999999999995,"HAFIZLIK YAZ EĞİTİMİNE HAK KAZANDINIZ"]
[70105068502,"YUSUF ERKAN",12,8,14,5,13,2,8,2,2,3,1,4,403.96,"HAFIZLIK YAZ EĞİTİMİNE HAK KAZANDINIZ"]
[57748480496,"YAĞIZ EFE BAKİ",13,7,13,6,12,3,7,3,3,2,4,1,402.68,"HAFIZLIK YAZ EĞİTİMİNE HAK KAZANDINIZ"]
[18641783930,"HALİL İBRAHİM TOPAL",13,7,14,6,11,4,8,2,4,1,1,4,400.03000000000003,"HAFIZLIK YAZ EĞİTİMİNE HAK KAZANDINIZ"]
[18581769230,"MİRAÇ BAŞKAN",13,7,11,8,14,1,6,4,3,2,2,3,398.68,"HAFIZLIK YAZ EĞİTİMİNE HAK KAZANDINIZ"]
[28775429420,"AHMET KAYRA YAYLA",13,5,11,6,13,2,7,3,2,3,1,4,397.31,"HAFIZLIK YAZ EĞİTİMİNE HAK KAZANDINIZ"]
[18293778858,"MUHAMMED MUSTAFA KARAGÖZ",15,5,13,7,9,5,5,5,2,3,2,3,390.65,"HAFIZLIK YAZ EĞİTİMİNE HAK KAZANDINIZ"]
[65353226934,"BARAN TANRIKULU",11,9,14,6,12,3,6,4,2,3,0,5,388,"HAFIZLIK YAZ EĞİTİMİNE HAK KAZANDINIZ"]
[24275579450,"İBRAHİM MERT TERZİ",14,6,9,11,12,3,4,6,4,1,2,3,379.99,"HAFIZLIK YAZ EĞİTİMİNE HAK KAZANDINIZ"]
[23672616294,"ALİ MACİT ALBAYRAK",12,8,13,7,10,5,4,6,2,3,1,4,375.99,"HAFIZLIK YAZ EĞİTİMİNE HAK KAZANDINIZ"]
[22169666378,"MALİK KEMAL ALBAYRAK",12,7,7,5,12,3,8,2,3,1,0,4,372.67,"HAFIZLIK YAZ EĞİTİMİNE HAK KAZANDINIZ"]
[69214098166,"EBUBEKİR KARADENİZ",11,9,7,10,14,1,7,3,3,2,3,2,372.02,"HAFIZLIK YAZ EĞİTİMİNE HAK KAZANDINIZ"]
["119309 5534","AHMET AKİF ÇAKAR",12,6,7,9,10,4,3,6,3,2,2,1,355.68,"KAZANAMADINIZ"]
[53014638134,"ARİF ENES KURTOĞLU",10,7,6,3,11,4,3,7,3,2,1,4,352.03000000000003,"KAZANAMADINIZ"]
[67177166168,"MEHM AKİF TEKNECİ",8,11,9,8,11,3,5,4,3,2,1,4,348.31,"KAZANAMADINIZ"]
[42125001128,"EMİR YILDIRIM",6,8,9,4,10,2,4,3,2,1,2,2,347.32,"KAZANAMADINIZ"]
[26510521620,"MUHAMMET EMİN ÖZTÜRK",12,5,6,5,8,7,3,7,1,4,1,4,341.33000000000004,"KAZANAMADINIZ"]
[57748480328,"VEHBİ SAĞLAM",10,10,10,10,6,9,3,7,1,4,1,4,325.37000000000006,"KAZANAMADINIZ"]
[46300861996,"İBRAHİM HAKKI BİRİNCİ",5,15,11,9,7,8,4,6,1,4,1,4,310.66,"KAZANAMADINIZ"]
[14888166192,"YUSUF TAHA ATMACA",10,9,5,8,6,9,1,5,0,0,0,0,308.65,"KAZANAMADINIZ"]
[31328361030,"YUSUF GARİP",9,9,6,10,6,8,0,10,0,4,0,4,302.01000000000005,"KAZANAMADINIZ"]
[32027321066,"BİLAL ESMER",9,11,6,14,6,9,3,6,2,3,2,3,301.64,"KAZANAMADINIZ"]
[20122430622,"AYAZ İSPİROĞLU",6,14,7,13,8,7,6,4,1,4,0,5,301.35,"KAZANAMADINIZ"]
[64756225186,"MUHAMMED EYMEN ŞENER",5,10,4,8,7,6,2,5,1,2,0,2,291.98999999999995,"KAZANAMADINIZ"]
[15914858180,"BEDİRHAN BAL",7,13,8,12,3,12,4,6,0,5,0,5,281.34,"KAZANAMADINIZ"]
[29000437364,"MUHAMMET YASİR YILDIRIM",3,17,6,14,4,11,2,8,3,2,0,5,255.95000000000002,"KAZANAMADINIZ"]
[60361391278,"EYMEN UÇAR",4,16,3,17,4,11,5,5,3,2,1,4,250.65,"KAZANAMADINIZ"]
[]
[55249563762,"ZEYNEP KOYUNOĞLU",20,0,19,1,15,0,10,0,4,1,5,0,493.35,"OKULUMUZDA EĞİTİM ALMAYA HAK KAZANDINIZ"]
[18317794796,"AYŞE BERRE YEŞİL",17,1,20,0,15,0,9,1,5,0,4,1,484.02000000000004,"OKULUMUZDA EĞİTİM ALMAYA HAK KAZANDINIZ"]
[50623701228,"HASAN SERDAR KÖSE",17,3,18,1,15,0,10,0,4,1,4,1,472.02000000000004,"OKULUMUZDA EĞİTİM ALMAYA HAK KAZANDINIZ"]
[18314065110,"HATİCE KÜBRA VURAL",17,3,17,1,15,0,7,2,3,0,3,0,463.01,"OKULUMUZDA EĞİTİM ALMAYA HAK KAZANDINIZ"]
[63388275798,"HAYRUNNİSA TERZİ",17,3,18,2,14,1,7,3,3,1,3,2,459,"OKULUMUZDA EĞİTİM ALMAYA HAK KAZANDINIZ"]
[19904741858,"AYŞE NUR ÇAVUŞOĞLU",16,3,18,0,14,0,6,4,2,2,4,1,457.67,"OKULUMUZDA EĞİTİM ALMAYA HAK KAZANDINIZ"]
[42457988760,"RAVZA NUR YAYLA",14,6,19,0,15,0,9,1,3,2,3,2,457.33,"OKULUMUZDA EĞİTİM ALMAYA HAK KAZANDINIZ"]
[50653362550,"MUHAMMED FATİH BAŞTAN",16,2,17,3,14,0,7,3,3,1,5,0,454.99,"OKULUMUZDA EĞİTİM ALMAYA HAK KAZANDINIZ"]
[18503788516,"SÜMEYYE AYDIN",17,3,17,3,14,1,9,1,3,2,2,3,454.68,"OKULUMUZDA EĞİTİM ALMAYA HAK KAZANDINIZ"]
[28957718298,"ZEYNEP SARE KALYONCU",18,2,13,1,14,1,8,2,5,0,4,0,451.01,"OKULUMUZDA EĞİTİM ALMAYA HAK KAZANDINIZ"]
[57424491174,"MUHAMMET HACISALİHOĞLU",16,4,16,4,14,1,8,2,5,0,5,0,449.37,"OKULUMUZDA EĞİTİM ALMAYA HAK KAZANDINIZ"]
[38101013636,"ENİSE SENA UYGUR",17,3,16,4,14,1,7,3,3,2,3,2,448.02,"OKULUMUZDA EĞİTİM ALMAYA HAK KAZANDINIZ"]
[51253681034,"YUSUF TALHA KOBYA",17,3,16,4,12,3,9,1,5,0,4,1,444.02000000000004,"OKULUMUZDA EĞİTİM ALMAYA HAK KAZANDINIZ"]
[30995350408,"MEHMET AKİF BOZO",16,4,18,2,11,4,9,1,2,3,4,1,440.02000000000004,"OKULUMUZDA EĞİTİM ALMAYA HAK KAZANDINIZ"]
[65203231934,"MEHMETHAN ATMACA",14,6,18,2,14,1,6,4,2,3,3,2,440,"OKULUMUZDA EĞİTİM ALMAYA HAK KAZANDINIZ"]
[62848310406,"ALMİNA EYLÜL KUDU",17,3,15,3,12,3,7,3,3,2,4,1,436,"OKULUMUZDA EĞİTİM ALMAYA HAK KAZANDINIZ"]
[18185777532,"ARİF SAİD İLKABAHAR",15,5,14,3,14,1,7,3,3,2,3,2,430.65999999999997,"OKULUMUZDA EĞİTİM ALMAYA HAK KAZANDINIZ"]
[50368704430,"MELİH YILMAZOĞLU",16,4,14,3,12,3,9,1,4,1,3,1,429.69000000000005,"OKULUMUZDA EĞİTİM ALMAYA HAK KAZANDINIZ"]
[25259726716,"AHMET MİRAÇ SEVEN",18,2,11,6,13,2,8,2,3,2,4,1,427.96999999999997,"OKULUMUZDA EĞİTİM ALMAYA HAK KAZANDINIZ"]
[71308011708,"ESNA GÜLSÜM KUDU",14,5,13,3,14,1,7,3,4,1,5,0,426.67,"OKULUMUZDA EĞİTİM ALMAYA HAK KAZANDINIZ"]
[61234362142,"HÜSEYİN TAHA ÇAKIR",15,5,15,3,12,3,6,4,3,2,4,1,423.99,"OKULUMUZDA EĞİTİM ALMAYA HAK KAZANDINIZ"]
[61648333790,"ELİF DEMİRCİ",12,7,14,4,15,0,8,1,3,2,4,1,423.03000000000003,"OKULUMUZDA EĞİTİM ALMAYA HAK KAZANDINIZ"]
[53269629642,"FEYZA HALİLOĞLU",17,3,12,3,12,3,7,3,3,2,1,4,420,"OKULUMUZDA EĞİTİM ALMAYA HAK KAZANDINIZ"]
[50437722044,"TUĞRA ARAL KIRAN",14,5,11,3,14,0,8,2,3,2,3,2,417.30999999999995,"OKULUMUZDA EĞİTİM ALMAYA HAK KAZANDINIZ"]
[42775979426,"KUZEY BAHADIR",14,6,15,2,11,4,6,2,3,1,3,0,415,"OKULUMUZDA EĞİTİM ALMAYA HAK KAZANDINIZ"]
[27706756482,"BETÜL ZEHRA BABÜR",14,6,10,8,15,0,10,0,5,0,3,2,414.65,"OKULUMUZDA EĞİTİM ALMAYA HAK KAZANDINIZ"]
[25133458382,"GÜLNİHAL KARAOSMANOĞLU",15,2,12,4,11,2,5,4,4,0,4,0,412.99,"OKULUMUZDA EĞİTİM ALMAYA HAK KAZANDINIZ"]
[50881707208,"SUDE NUR YAVUZ",15,5,14,4,11,3,6,3,3,1,1,3,411.67,"OKULUMUZDA EĞİTİM ALMAYA HAK KAZANDINIZ"]
[61714499078,"YUSUF EMİR KARLIDAĞ",15,4,12,4,12,3,5,5,4,1,3,1,411.03000000000003,"OKULUMUZDA EĞİTİM ALMAYA HAK KAZANDINIZ"]
[42634984134,"MERVE BAŞTAN",14,4,12,4,13,2,5,5,3,2,3,2,410.66999999999996,"OKULUMUZDA EĞİTİM ALMAYA HAK KAZANDINIZ"]
[17984958012,"EMRE ERGÜL",13,7,11,4,14,1,8,2,3,2,4,1,409.37,"OKULUMUZDA EĞİTİM ALMAYA HAK KAZANDINIZ"]
[16787997532,"MEHMET ZEKİ YILMAZ",16,4,10,8,12,3,8,2,3,1,5,0,407,"OKULUMUZDA EĞİTİM ALMAYA HAK KAZANDINIZ"]
[27251496994,"MEHMET AKİF EYÜPOĞLU",14,6,11,9,13,2,9,1,2,3,4,1,402.66,"OKULUMUZDA EĞİTİM ALMAYA HAK KAZANDINIZ"]
[21112367508,"GÜLSİMA KARAGÖZ",12,7,15,3,11,4,7,2,3,1,1,4,402.03000000000003,"OKULUMUZDA EĞİTİM ALMAYA HAK KAZANDINIZ"]
[49312759572,"MELİS DEMİR",13,4,8,0,14,0,6,4,2,2,2,2,402.01,"OKULUMUZDA EĞİTİM ALMAYA HAK KAZANDINIZ"]
[40877042710,"ELA ATALAR",13,6,10,9,15,0,6,3,3,1,2,2,401,"OKULUMUZDA EĞİTİM ALMAYA HAK KAZANDINIZ"]
[21029861212,"AHMET MUHAMMET GÜL",14,6,14,4,11,4,6,4,1,4,0,5,400.03000000000003,"OKULUMUZDA EĞİTİM ALMAYA HAK KAZANDINIZ"]
[56635515488,"AYŞEGÜL BAYRAKTAR",15,4,9,7,13,2,5,5,3,2,3,2,398.66999999999996,"OKULUMUZDA EĞİTİM ALMAYA HAK KAZANDINIZ"]
[61654350224,"ERVA EMİRAL",12,8,14,6,11,4,7,3,4,1,3,2,396,"OKULUMUZDA EĞİTİM ALMAYA HAK KAZANDINIZ"]
[14405908472,"MEHMET ERTUĞRUL ÖZTÜRK",13,7,13,5,11,4,5,5,4,1,2,3,394.68,"OKULUMUZDA EĞİTİM ALMAYA HAK KAZANDINIZ"]
[31430198548,"YUSUF ALİ BİRİNCİ",16,4,7,12,13,2,9,1,3,2,4,1,394.67,"OKULUMUZDA EĞİTİM ALMAYA HAK KAZANDINIZ"]
[56776510748,"ZEYNEP GÜLAL",14,6,10,9,12,3,8,2,3,2,5,0,394.65999999999997,"OKULUMUZDA EĞİTİM ALMAYA HAK KAZANDINIZ"]
[51466689780,"AHMET ÇAĞRI KALYONCU",12,8,11,9,13,2,7,3,3,2,3,2,389.29999999999995,"OKULUMUZDA EĞİTİM ALMAYA HAK KAZANDINIZ"]
[16980002736,"İSMAİL SELİM ÖZKAN",14,6,11,9,11,4,7,3,4,1,0,4,387.02000000000004,"OKULUMUZDA EĞİTİM ALMAYA HAK KAZANDINIZ"]
[57379476042,"ZEYNEP BETÜL TOKDEMİR",13,5,11,5,10,3,6,3,2,1,0,1,384.98,"KAZANAMADINIZ"]
[25946703860,"ÖYKÜ BAKAL",12,8,8,8,13,2,9,1,3,2,5,0,383.96,"KAZANAMADINIZ"]
[67540153900,"MERT ALİ AKÇAİR",16,4,12,8,9,6,1,9,2,3,1,4,382.67,"KAZANAMADINIZ"]
[30746380494,"BURHAN TERZİ",15,5,11,8,10,5,4,6,2,3,1,4,382.63,"KAZANAMADINIZ"]
[16790997468,"HASAN ALİ YILMAZ",13,7,9,11,12,3,8,2,4,1,3,2,381.33,"KAZANAMADINIZ"]
[44476922794,"SEYİT ALİ KIZILAY",13,6,11,3,9,6,6,4,2,3,2,3,378.67,"KAZANAMADINIZ"]
[64558253424,"ESLEM EYLÜL ERTÜRK",11,9,11,6,12,3,6,4,3,2,0,4,377.67,"KAZANAMADINIZ"]
[25520706850,"ENSAR ATALAR",13,7,9,10,12,3,6,4,2,3,3,2,377.36,"KAZANAMADINIZ"]
[45901875234,"BETÜL ÖZTÜRK",12,8,12,6,9,6,8,2,3,2,3,2,377.30999999999995,"KAZANAMADINIZ"]
[53326140486,"TALHA YASİR DEMİRTÜRK",13,7,11,9,10,5,4,6,3,2,3,2,374.65999999999997,"KAZANAMADINIZ"]
[53833595090,"HİRANUR ARSLAN",15,5,9,2,7,3,2,2,1,2,0,1,371.96999999999997,"KAZANAMADINIZ"]
[47674816216,"ELÇİN BALTÜRK",14,5,7,9,11,4,6,4,2,3,1,4,369.34000000000003,"KAZANAMADINIZ"]
[41426024430,"TUNAHAN ÇİLİNGİR",11,6,11,6,10,5,6,4,0,5,0,5,366.65,"KAZANAMADINIZ"]
[20030901016,"YUSUF EMRE GÜLAY",8,8,13,5,9,4,3,2,1,1,3,2,362.65,"KAZANAMADINIZ"]
[14895072264,"AMİNE YAZICI",12,8,9,11,10,5,8,2,2,3,2,3,361.28999999999996,"KAZANAMADINIZ"]
[62611318356,"POYRAZ AYDI N",8,12,10,10,13,2,3,7,2,3,3,2,356,"KAZANAMADINIZ"]
[19367923112,"UTKU TOMAR",10,10,8,11,12,3,3,7,3,2,1,4,350.67,"KAZANAMADINIZ"]
[69121101348,"YASER TAHA KILAVUZOĞLU",10,10,12,8,8,7,2,8,2,3,1,4,346.68,"KAZANAMADINIZ"]
[52315659466,"ELANUR CENGİZ",9,11,9,4,7,8,7,3,3,2,4,1,341.32,"KAZANAMADINIZ"]
[12593985596,"MUSTAFA ERDEM",13,7,9,11,6,9,4,6,2,3,2,3,340,"KAZANAMADINIZ"]
[23255630174,"ÇINAR BAYRAKTAR",13,7,8,12,7,8,4,6,1,4,0,5,336,"KAZANAMADINIZ"]
[25010554978,"EKİN GÜDÜ",12,7,5,15,8,7,9,0,2,3,2,3,332.36,"KAZANAMADINIZ"]
[25694548812,"BERRA SİNAN",11,5,3,6,9,6,2,8,1,2,3,1,331.65,"KAZANAMADINIZ"]
[54214596118,"ELİF TERZİ",12,7,8,10,5,10,6,4,1,4,0,5,326.71000000000004,"KAZANAMADINIZ"]
[12944957180,"AKİF EMİN AYDIN",5,1,3,1,8,3,4,2,2,1,0,0,322.36,"KAZANAMADINIZ"]
[59809395008,"HİLAL YANIK",8,12,6,14,9,6,4,6,3,2,1,4,313.32,"KAZANAMADINIZ"]
[49297760082,"ALİ EFE BEKTAŞ",8,12,6,13,9,6,4,6,2,3,0,5,312.01,"KAZANAMADINIZ"]
[15416891432,"YUSUF MİRZA ÇOLAK",4,16,10,10,6,9,4,6,2,3,5,0,301.36,"KAZANAMADINIZ"]
[14504905198,"NURETTİN EFE KAYAŞİMŞİR",9,11,7,12,5,10,3,7,1,4,0,5,298.67,"KAZANAMADINIZ"]
[62026335726,"HASAN AKDENİZ",5,14,2,2,6,3,0,0,0,0,0,0,286.64,"KAZANAMADINIZ"]

{"sheet":"ÖĞRENCİ SONUÇ EKRANI","index":1,"n_rows":29,"n_cols":16,"rows_kept":29,"merged":[[8,1,17,4],[8,11,17,21],[11,5,12,10],[13,5,13,10],[14,5,14,10],[16,6,16,9],[18,1,19,2],[18,3,18,4],[18,5,18,6],[18,7,18,8],[18,9,18,10],[18,11,18,12],[18,13,18,14],[18,15,19,15],[20,1,21,2],[20,3,21,3],[20,4,21,4],[20,5,21,5],[20,6,21,6],[20,7,21,7],[20,8,21,8],[20,9,21,9],[20,10,21,10],[20,11,21,11],[20,12,21,12],[20,13,21,13],[20,14,21,14],[20,15,21,15],[28,3,28,12]]}
{"$rows_empty":11}
[{"$nulls":5},"HİKMET KAAN İMAM HATİP"]
[]
[{"$nulls":5},"ORTAOKULU SONUÇ EKRANI"]
[{"$nulls":5},"TC KİMLİK NO"]
[]
[]
[]
[null,"ADI SOYADI",null,"TÜRKÇE",null,"MATEMATİK",null,"FEN",null,"SOSYAL",null,"DİN",null,"İNGİLİZCE",null,"PUAN"]
[{"$nulls":3},true,false,true,false,true,false,true,false,true,false,true,false]
[null,{"$f":"VLOOKUP(G17,'NET-PUAN-ORTALAMA'!A3:'NET-PUAN-ORTALAMA'!P300,2,0)","v":{"$error":"#N/A"}},null,{"$f":"VLOOKUP(G17,'NET-PUAN-ORTALAMA'!A3:P300,3,0)","v":{"$error":"#N/A"}},{"$f":"VLOOKUP(G17,'NET-PUAN-ORTALAMA'!A3:P300,4,0)","v":{"$error":"#N/A"}},{"$f":"VLOOKUP(G17,'NET-PUAN-ORTALAMA'!A3:P300,5,0)","v":{"$error":"#N/A"}},{"$f":"VLOOKUP(G17,'NET-PUAN-ORTALAMA'!A3:P300,6,0)","v":{"$error":"#N/A"}},{"$f":"VLOOKUP(G17,'NET-PUAN-ORTALAMA'!A3:P300,7,0)","v":{"$error":"#N/A"}},{"$f":"VLOOKUP(G17,'NET-PUAN-ORTALAMA'!A3:P300,8,0)","v":{"$error":"#N/A"}},{"$f":"VLOOKUP(G17,'NET-PUAN-ORTALAMA'!A3:P300,9,0)","v":{"$error":"#N/A"}},{"$f":"VLOOKUP(G17,'NET-PUAN-ORTALAMA'!A3:P300,10,0)","v":{"$error":"#N/A"}},{"$f":"VLOOKUP(G17,'NET-PUAN-ORTALAMA'!A3:P300,11,0)","v":{"$error":"#N/A"}},{"$f":"VLOOKUP(G17,'NET-PUAN-ORTALAMA'!A3:P300,12,0)","v":{"$error":"#N/A"}},{"$f":"VLOOKUP(G17,'NET-PUAN-ORTALAMA'!A3:P300,13,0)","v":{"$error":"#N/A"}},{"$f":"VLOOKUP(G17,'NET-PUAN-ORTALAMA'!A3:P300,14,0)","v":{"$error":"#N/A"}},{"$f":"VLOOKUP(G17,'NET-PUAN-ORTALAMA'!A3:P300,15,0)","v":{"$error":"#N/A"}}]
{"$rows_empty":7}
[{"$nulls":3},{"$f":"VLOOKUP(G17,'NET-PUAN-ORTALAMA'!A3:P300,16,0)","v":{"$error":"#N/A"}}]